Reaction Details
TargetPlatelet-activating factor acetylhydrolase IB subunit alpha2
LigandBDBM50188244
Substrate/Competitorn/a
Meas. Tech.ChEMBL_1589917 (CHEMBL3830797)
IC50 3000±n/a nM
Citation Sarma, BKLiu, XKodadek, T Identification of selective covalent inhibitors of platelet activating factor acetylhydrolase 1B2 from the screening of an oxadiazolone-capped peptoid-azapeptoid hybrid library. Bioorg Med Chem24:3953-3963 (2016) 
 
Platelet-activating factor acetylhydrolase IB subunit alpha2
Name:Platelet-activating factor acetylhydrolase IB subunit alpha2
Type:PROTEIN
Mol. Mass.:25565.45
Organism:Homo sapiens (Human)
Description:ChEMBL_18054
Residue:229
BDBM50188244
NameBDBM50188244
Synonyms:CHEMBL3828405
TypeSmall organic molecule
Emp. Form.C49H58Br2ClN13O11S
Mol. Mass.1232.391
SMILESCOCCN(CC(=O)N(CCCCN)CC(=O)N(CCCCN)CC(N)=O)C(=O)CN(NC(=O)Nc1ccc(Br)cc1)C(=O)CN(NC(=O)c1ccc(Cl)cc1)C(=O)Cn1nc(oc1=O)-c1ccc(s1)-c1ccc(Br)cc1