Reaction Details
TargetPoly [ADP-ribose] polymerase tankyrase-2
LigandBDBM50188595
Substrate/Competitorn/a
Meas. Tech.ChEMBL_1589940 (CHEMBL3830930)
IC50 49±n/a nM
Citation Nathubhai, AHaikarainen, THayward, PCMuñoz-Descalzo, SThompson, ASLloyd, MDLehtiö, LThreadgill, MD Structure-activity relationships of 2-arylquinazolin-4-ones as highly selective and potent inhibitors of the tankyrases. Eur J Med Chem118:316-27 (2016) 
 
Poly [ADP-ribose] polymerase tankyrase-2
Name:Poly [ADP-ribose] polymerase tankyrase-2
Type:Enzyme
Mol. Mass.:126937.16
Organism:Homo sapiens (Human)
Description:Q9H2K2
Residue:1166
BDBM50188595
NameBDBM50188595
Synonyms:CHEMBL3099681
TypeSmall organic molecule
Emp. Form.C14H9ClN2O2
Mol. Mass.272.686
SMILESOc1cccc2c1nc([nH]c2=O)-c1ccc(Cl)cc1