Reaction Details
TargetHistone deacetylase 3
LigandBDBM50189908
Substrate/Competitorn/a
Meas. Tech.ChEMBL_1591003 (CHEMBL3830981)
IC50 25900±n/a nM
Citation Wagner, FFWeïwer, MSteinbacher, SSchomburg, AReinemer, PGale, JPCampbell, AJFisher, SLZhao, WNReis, SAHennig, KMThomas, MMüller, PJefson, MRFass, DMHaggarty, SJZhang, YLHolson, EB Kinetic and structural insights into the binding of histone deacetylase 1 and 2 (HDAC1, 2) inhibitors. Bioorg Med Chem24:4008-4015 (2016) 
 
Histone deacetylase 3
Name:Histone deacetylase 3
Type:Enzyme
Mol. Mass.:48829.55
Organism:Homo sapiens (Human)
Description:O15379
Residue:428
BDBM50189908
NameBDBM50189908
Synonyms:CHEMBL3827993
TypeSmall organic molecule
Emp. Form.C22H19FN2O2
Mol. Mass.362.3969
SMILESNc1ccc(cc1NC(=O)C1Cc2ccccc2CO1)-c1ccc(F)cc1