Reaction Details
TargetHistone deacetylase 8
LigandBDBM29589
Substrate/Competitorn/a
Meas. Tech.ChEMBL_1591062 (CHEMBL3828939)
IC50 231±n/a nM
Citation Wagner, FFWeïwer, MSteinbacher, SSchomburg, AReinemer, PGale, JPCampbell, AJFisher, SLZhao, WNReis, SAHennig, KMThomas, MMüller, PJefson, MRFass, DMHaggarty, SJZhang, YLHolson, EB Kinetic and structural insights into the binding of histone deacetylase 1 and 2 (HDAC1, 2) inhibitors. Bioorg Med Chem24:4008-4015 (2016) 
 
Histone deacetylase 8
Name:Histone deacetylase 8
Type:Enzyme
Mol. Mass.:41749.60
Organism:Homo sapiens (Human)
Description:Q9BY41
Residue:377
BDBM29589
NameBDBM29589
Synonyms:Faridak LBH-589B US10722597, Compound Panobinostat
TypeSmall organic molecule
Emp. Form.C21H23N3O2
Mol. Mass.349.4262
SMILESCc1[nH]c2ccccc2c1CCNCc1ccc(\C=C\C(=O)NO)cc1