Reaction Details
TargetHistone deacetylase 1
LigandBDBM50189909
Substrate/Competitorn/a
Meas. Tech.ChEMBL_1590996 (CHEMBL3830868)
IC50 72±n/a nM
Citation Wagner, FFWeïwer, MSteinbacher, SSchomburg, AReinemer, PGale, JPCampbell, AJFisher, SLZhao, WNReis, SAHennig, KMThomas, MMüller, PJefson, MRFass, DMHaggarty, SJZhang, YLHolson, EB Kinetic and structural insights into the binding of histone deacetylase 1 and 2 (HDAC1, 2) inhibitors. Bioorg Med Chem24:4008-4015 (2016) 
 
Histone deacetylase 1
Name:Histone deacetylase 1
Type:Enzyme
Mol. Mass.:55090.27
Organism:Homo sapiens (Human)
Description:Q13547
Residue:482
BDBM50189909
NameBDBM50189909
Synonyms:CHEMBL3827363
TypeSmall organic molecule
Emp. Form.C22H19FN2O2
Mol. Mass.362.3969
SMILESNc1ccc(cc1NC(=O)C1COc2ccccc2C1)-c1ccc(F)cc1