Reaction Details
TargetHistone deacetylase 2
LigandBDBM50189907
Substrate/Competitorn/a
Meas. Tech.ChEMBL_1591001 (CHEMBL3830979)
IC50 6560±n/a nM
Citation Wagner, FFWeïwer, MSteinbacher, SSchomburg, AReinemer, PGale, JPCampbell, AJFisher, SLZhao, WNReis, SAHennig, KMThomas, MMüller, PJefson, MRFass, DMHaggarty, SJZhang, YLHolson, EB Kinetic and structural insights into the binding of histone deacetylase 1 and 2 (HDAC1, 2) inhibitors. Bioorg Med Chem24:4008-4015 (2016) 
 
Histone deacetylase 2
Name:Histone deacetylase 2
Type:Chromatin regulator; hydrolase; repressor
Mol. Mass.:55356.54
Organism:Homo sapiens (Human)
Description:Q92769
Residue:488
BDBM50189907
NameBDBM50189907
Synonyms:CHEMBL3828015
TypeSmall organic molecule
Emp. Form.C22H19FN2O2
Mol. Mass.362.3969
SMILESNc1ccc(cc1NC(=O)C1CCc2ccccc2O1)-c1ccc(F)cc1