Reaction Details
TargetEndoplasmic reticulum aminopeptidase 2
LigandBDBM50170876
Substrate/Competitorn/a
Meas. Tech.ChEBML_1591204
Ki 8230±n/a nM
Citation Weglarz-Tomczak, EVassiliou, SMucha, A Discovery of potent and selective inhibitors of human aminopeptidases ERAP1 and ERAP2 by screening libraries of phosphorus-containing amino acid and dipeptide analogues. Bioorg Med Chem Lett26:4122-6 (2016) 
 
Endoplasmic reticulum aminopeptidase 2
Name:Endoplasmic reticulum aminopeptidase 2
Type:PROTEIN
Mol. Mass.:110463.90
Organism:Homo sapiens (Human)
Description:ChEMBL_1473169
Residue:960
BDBM50170876
NameBDBM50170876
Synonyms:CHEMBL3805817
TypeSmall organic molecule
Emp. Form.C10H17N2O4P
Mol. Mass.260.2267
SMILESCOc1ccc(CNCC(N)P(O)(O)=O)cc1