Reaction Details
TargetEndoplasmic reticulum aminopeptidase 1
LigandBDBM50025043
Substrate/Competitorn/a
Meas. Tech.ChEBML_1591201
Ki 991±n/a nM
Citation Weglarz-Tomczak, EVassiliou, SMucha, A Discovery of potent and selective inhibitors of human aminopeptidases ERAP1 and ERAP2 by screening libraries of phosphorus-containing amino acid and dipeptide analogues. Bioorg Med Chem Lett26:4122-6 (2016) 
 
Endoplasmic reticulum aminopeptidase 1
Name:Endoplasmic reticulum aminopeptidase 1
Type:PROTEIN
Mol. Mass.:107232.03
Organism:Homo sapiens (Human)
Description:ChEMBL_1473167
Residue:941
BDBM50025043
NameBDBM50025043
Synonyms:CHEMBL3355104
TypeSmall organic molecule
Emp. Form.C20H26NO5P
Mol. Mass.391.3979
SMILESNC(CCc1ccc(CO)cc1)P(O)(=O)CC(Cc1ccccc1)C(O)=O