Reaction Details
TargetEndoplasmic reticulum aminopeptidase 2
LigandBDBM50190112
Substrate/Competitorn/a
Meas. Tech.ChEBML_1591204
Ki 1040±n/a nM
Citation Weglarz-Tomczak, EVassiliou, SMucha, A Discovery of potent and selective inhibitors of human aminopeptidases ERAP1 and ERAP2 by screening libraries of phosphorus-containing amino acid and dipeptide analogues. Bioorg Med Chem Lett26:4122-6 (2016) 
 
Endoplasmic reticulum aminopeptidase 2
Name:Endoplasmic reticulum aminopeptidase 2
Type:PROTEIN
Mol. Mass.:110463.90
Organism:Homo sapiens (Human)
Description:ChEMBL_1473169
Residue:960
BDBM50190112
NameBDBM50190112
Synonyms:CHEMBL88808
TypeSmall organic molecule
Emp. Form.C19H24NO5P
Mol. Mass.377.3713
SMILESNC(CCc1ccccc1)P(O)(=O)CC(Cc1ccc(O)cc1)C(O)=O