Reaction Details
TargetEndoplasmic reticulum aminopeptidase 2
LigandBDBM50190110
Substrate/Competitorn/a
Meas. Tech.ChEBML_1591204
Ki 1030±n/a nM
Citation Weglarz-Tomczak, EVassiliou, SMucha, A Discovery of potent and selective inhibitors of human aminopeptidases ERAP1 and ERAP2 by screening libraries of phosphorus-containing amino acid and dipeptide analogues. Bioorg Med Chem Lett26:4122-6 (2016) 
 
Endoplasmic reticulum aminopeptidase 2
Name:Endoplasmic reticulum aminopeptidase 2
Type:PROTEIN
Mol. Mass.:110463.90
Organism:Homo sapiens (Human)
Description:ChEMBL_1473169
Residue:960
BDBM50190110
NameBDBM50190110
Synonyms:CHEMBL254284
TypeSmall organic molecule
Emp. Form.C19H24NO4P
Mol. Mass.361.3719
SMILESN[C@@H](CCc1ccccc1)P(O)(=O)C[C@@H](Cc1ccccc1)C(O)=O