Reaction Details
TargetEndoplasmic reticulum aminopeptidase 1
LigandBDBM50025050
Substrate/Competitorn/a
Meas. Tech.ChEBML_1591201
Ki 18600±n/a nM
Citation Weglarz-Tomczak, EVassiliou, SMucha, A Discovery of potent and selective inhibitors of human aminopeptidases ERAP1 and ERAP2 by screening libraries of phosphorus-containing amino acid and dipeptide analogues. Bioorg Med Chem Lett26:4122-6 (2016) 
 
Endoplasmic reticulum aminopeptidase 1
Name:Endoplasmic reticulum aminopeptidase 1
Type:PROTEIN
Mol. Mass.:107232.03
Organism:Homo sapiens (Human)
Description:ChEMBL_1473167
Residue:941
BDBM50025050
NameBDBM50025050
Synonyms:CHEMBL3355108
TypeSmall organic molecule
Emp. Form.C20H27N2O4P
Mol. Mass.390.4131
SMILESNCc1cccc(CC(CP(O)(=O)C(N)CCc2ccccc2)C(O)=O)c1