Reaction Details
TargetEndoplasmic reticulum aminopeptidase 1
LigandBDBM50170900
Substrate/Competitorn/a
Meas. Tech.ChEBML_1591201
Ki>250000±n/a nM
Citation Weglarz-Tomczak, EVassiliou, SMucha, A Discovery of potent and selective inhibitors of human aminopeptidases ERAP1 and ERAP2 by screening libraries of phosphorus-containing amino acid and dipeptide analogues. Bioorg Med Chem Lett26:4122-6 (2016) 
 
Endoplasmic reticulum aminopeptidase 1
Name:Endoplasmic reticulum aminopeptidase 1
Type:PROTEIN
Mol. Mass.:107232.03
Organism:Homo sapiens (Human)
Description:ChEMBL_1473167
Residue:941
BDBM50170900
NameBDBM50170900
Synonyms:CHEMBL3806247
TypeSmall organic molecule
Emp. Form.C8H21N2O3P
Mol. Mass.224.2377
SMILESCCCCCCNCC(N)P(O)(O)=O