Reaction Details
TargetCarbonic anhydrase 2
LigandBDBM50190136
Substrate/Competitorn/a
Meas. Tech.ChEBML_1591367
Ki 1.1±n/a nM
Citation Bozdag, MAlafeefy, AMCarta, FCeruso, MAl-Tamimi, ASAl-Kahtani, AAAlasmary, FASSupuran, CT Synthesis 4-[2-(2-mercapto-4-oxo-4H-quinazolin-3-yl)-ethyl]-benzenesulfonamides with subnanomolar carbonic anhydrase II and XII inhibitory properties. Bioorg Med Chem24:4100-4107 (2016) 
 
Carbonic anhydrase 2
Name:Carbonic anhydrase 2
Type:Enzyme
Mol. Mass.:29250.71
Organism:Homo sapiens (Human)
Description:P00918
Residue:260
BDBM50190136
NameBDBM50190136
Synonyms:CHEMBL3827113
TypeSmall organic molecule
Emp. Form.C18H19N3O5S2
Mol. Mass.421.491
SMILESCOc1cc2nc(S)n(CCc3ccc(cc3)S(N)(=O)=O)c(=O)c2cc1OC