Reaction Details
TargetBeta-hexosaminidase subunit alpha/beta
LigandBDBM50190645
Substrate/Competitorn/a
Meas. Tech.ChEMBL_1611891 (CHEMBL3853691)
IC50 315000±n/a nM
Citation de la Fuente, ARísquez-Cuadro, RVerdaguer, XGarcía Fernández, JMNanba, EHigaki, KOrtiz Mellet, CRiera, A Efficient stereoselective synthesis of 2-acetamido-1,2-dideoxyallonojirimycin (DAJNAc) and sp(2)-iminosugar conjugates: Novel hexosaminidase inhibitors with discrimination capabilities between the mature and precursor forms of the enzyme. Eur J Med Chem121:926-938 (2016) 
 
Beta-hexosaminidase subunit alpha/beta
Name:Beta-hexosaminidase subunit alpha/beta
Synonyms:Beta-N-acetyl-D-hexosaminidase-A/B
Type:n/a
Mol. Mass.:n/a
Description:ASSAY_ID of ChEMBL is 1496351
Components:This complex has 2 components.
Component 1
Name:Beta-hexosaminidase subunit alpha
Type:Protein
Mol. Mass.:60688.46
Organism:Homo sapiens (Human)
Description:P06865
Residue:529
Component 2
Name:Beta-hexosaminidase subunit beta
Synonyms:Beta-N-acetylhexosaminidase subunit beta Beta-hexosaminidase subunit beta (Hex B) HEXB_HUMAN | Hexosaminidase subunit B
Type:Enzyme
Mol. Mass.:63112.58
Organism:Homo sapiens (Human)
Description:P07686
Residue:556
BDBM50190645
NameBDBM50190645
Synonyms:CHEMBL3982827
TypeSmall organic molecule
Emp. Form.C15H19N3O3S
Mol. Mass.321.395
SMILES[H][C@]12CS\C(=N/c3ccccc3)N1C[C@H](NC(C)=O)[C@H](O)[C@@H]2O