Reaction Details
TargetVoltage-dependent L-type calcium channel subunit alpha-1C
LigandBDBM50192669
Substrate/Competitorn/a
Meas. Tech.ChEBML_1613525
IC50 5400±n/a nM
Citation Remen, LBezençon, OSimons, LGaston, RDowning, DGatfield, JRoch, CKessler, MMosbacher, JPfeifer, TGrisostomi, CRey, MErtel, EAMoon, R Preparation, Antiepileptic Activity, and Cardiovascular Safety of Dihydropyrazoles as Brain-Penetrant T-Type Calcium Channel Blockers. J Med Chem59:8398-411 (2016) 
 
Voltage-dependent L-type calcium channel subunit alpha-1C
Name:Voltage-dependent L-type calcium channel subunit alpha-1C
Type:Enzyme Catalytic Domain
Mol. Mass.:248979.79
Organism:Homo sapiens (Human)
Description:Calcium channel (Type L) 0 HUMAN::Q13936
Residue:2221
BDBM50192669
NameBDBM50192669
Synonyms:CHEMBL3962647
TypeSmall organic molecule
Emp. Form.C21H16F2N4O
Mol. Mass.378.3747
SMILESFc1ccc(NC(=O)N2N=C(C[C@H]2c2ccc(F)cc2)c2ccncc2)cc1