Reaction Details
TargetVoltage-dependent L-type calcium channel subunit alpha-1C
LigandBDBM50192733
Substrate/Competitorn/a
Meas. Tech.ChEBML_1613525
IC50>10000±n/a nM
Citation Remen, LBezençon, OSimons, LGaston, RDowning, DGatfield, JRoch, CKessler, MMosbacher, JPfeifer, TGrisostomi, CRey, MErtel, EAMoon, R Preparation, Antiepileptic Activity, and Cardiovascular Safety of Dihydropyrazoles as Brain-Penetrant T-Type Calcium Channel Blockers. J Med Chem59:8398-411 (2016) 
 
Voltage-dependent L-type calcium channel subunit alpha-1C
Name:Voltage-dependent L-type calcium channel subunit alpha-1C
Type:Enzyme Catalytic Domain
Mol. Mass.:248979.79
Organism:Homo sapiens (Human)
Description:Calcium channel (Type L) 0 HUMAN::Q13936
Residue:2221
BDBM50192733
NameBDBM50192733
Synonyms:CHEMBL3914689
TypeSmall organic molecule
Emp. Form.C24H21BrFN3O
Mol. Mass.466.345
SMILESCCc1ccc(NC(=O)N2N=C(CC2c2ccc(F)cc2)c2ccc(Br)cc2)cc1