Reaction Details
TargetVoltage-dependent T-type calcium channel subunit alpha-1H
LigandBDBM50192736
Substrate/Competitorn/a
Meas. Tech.ChEBML_1613535
IC50 46±n/a nM
Citation Remen, LBezençon, OSimons, LGaston, RDowning, DGatfield, JRoch, CKessler, MMosbacher, JPfeifer, TGrisostomi, CRey, MErtel, EAMoon, R Preparation, Antiepileptic Activity, and Cardiovascular Safety of Dihydropyrazoles as Brain-Penetrant T-Type Calcium Channel Blockers. J Med Chem59:8398-411 (2016) 
 
Voltage-dependent T-type calcium channel subunit alpha-1H
Name:Voltage-dependent T-type calcium channel subunit alpha-1H
Type:Enzyme Catalytic Domain
Mol. Mass.:259187.68
Organism:Homo sapiens (Human)
Description:Calcium channel (Type T,L) 0 0::O95180
Residue:2353
BDBM50192736
NameBDBM50192736
Synonyms:CHEMBL3966141
TypeSmall organic molecule
Emp. Form.C22H16BrF2N3O
Mol. Mass.456.283
SMILESFc1ccc(cc1)C1CC(=NN1C(=O)Nc1cccc(F)c1)c1ccc(Br)cc1