Reaction Details
TargetVoltage-dependent T-type calcium channel subunit alpha-1H
LigandBDBM50192666
Substrate/Competitorn/a
Meas. Tech.ChEBML_1613535
IC50 690±n/a nM
Citation Remen, LBezençon, OSimons, LGaston, RDowning, DGatfield, JRoch, CKessler, MMosbacher, JPfeifer, TGrisostomi, CRey, MErtel, EAMoon, R Preparation, Antiepileptic Activity, and Cardiovascular Safety of Dihydropyrazoles as Brain-Penetrant T-Type Calcium Channel Blockers. J Med Chem59:8398-411 (2016) 
 
Voltage-dependent T-type calcium channel subunit alpha-1H
Name:Voltage-dependent T-type calcium channel subunit alpha-1H
Type:Enzyme Catalytic Domain
Mol. Mass.:259187.68
Organism:Homo sapiens (Human)
Description:Calcium channel (Type T,L) 0 0::O95180
Residue:2353
BDBM50192666
NameBDBM50192666
Synonyms:CHEMBL3893591
TypeSmall organic molecule
Emp. Form.C30H34FN5O
Mol. Mass.499.6223
SMILESCN1CCN(CCC2(CC(=NN2C(=O)Nc2ccc(F)cc2)c2ccccc2)c2ccc(C)cc2)CC1