Reaction Details
TargetVoltage-dependent T-type calcium channel subunit alpha-1I
LigandBDBM50192665
Substrate/Competitorn/a
Meas. Tech.ChEMBL_1613536 (CHEMBL3855336)
IC50 7000±n/a nM
Citation Remen, LBezençon, OSimons, LGaston, RDowning, DGatfield, JRoch, CKessler, MMosbacher, JPfeifer, TGrisostomi, CRey, MErtel, EAMoon, R Preparation, Antiepileptic Activity, and Cardiovascular Safety of Dihydropyrazoles as Brain-Penetrant T-Type Calcium Channel Blockers. J Med Chem59:8398-411 (2016) 
 
Voltage-dependent T-type calcium channel subunit alpha-1I
Name:Voltage-dependent T-type calcium channel subunit alpha-1I
Type:PROTEIN
Mol. Mass.:245101.25
Organism:Homo sapiens (Human)
Description:ChEMBL_538845
Residue:2223
BDBM50192665
NameBDBM50192665
Synonyms:CHEMBL3892579
TypeSmall organic molecule
Emp. Form.C21H16F2N4O
Mol. Mass.378.3747
SMILESFc1ccc(NC(=O)N2N=C(CC2c2ccc(F)cc2)c2ccncc2)cc1