Reaction Details
TargetVoltage-dependent T-type calcium channel subunit alpha-1H
LigandBDBM50192664
Substrate/Competitorn/a
Meas. Tech.ChEMBL_1613524 (CHEMBL3855324)
IC50 430±n/a nM
Citation Remen, LBezençon, OSimons, LGaston, RDowning, DGatfield, JRoch, CKessler, MMosbacher, JPfeifer, TGrisostomi, CRey, MErtel, EAMoon, R Preparation, Antiepileptic Activity, and Cardiovascular Safety of Dihydropyrazoles as Brain-Penetrant T-Type Calcium Channel Blockers. J Med Chem59:8398-411 (2016) 
 
Voltage-dependent T-type calcium channel subunit alpha-1H
Name:Voltage-dependent T-type calcium channel subunit alpha-1H
Type:Enzyme Catalytic Domain
Mol. Mass.:259187.68
Organism:Homo sapiens (Human)
Description:Calcium channel (Type T,L) 0 0::O95180
Residue:2353
BDBM50192664
NameBDBM50192664
Synonyms:CHEMBL3902564
TypeSmall organic molecule
Emp. Form.C29H31FN4O2
Mol. Mass.486.5804
SMILESCc1ccc(cc1)C1(CCN2CCOCC2)CC(=NN1C(=O)Nc1ccc(F)cc1)c1ccccc1