Reaction Details
TargetNischarin
LigandBDBM50193035
Substrate/Competitorn/a
Meas. Tech.ChEMBL_1614150 (CHEMBL3855950)
Ki 4.0±n/a nM
Citation Giusepponi, MECifani, CMicioni Di Bonaventura, MVMattioli, LHudson, ADiamanti, EDel Bello, FGiannella, MMammoli, VPaoletti, CDPiergentili, APigini, MQuaglia, W Combined Interactions with I ACS Med Chem Lett7:956-961 (2016) 
 
Nischarin
Name:Nischarin
Type:Enzyme Catalytic Domain
Mol. Mass.:166460.59
Organism:RAT
Description:Q4G017
Residue:1502
BDBM50193035
NameBDBM50193035
Synonyms:CHEMBL3961335
TypeSmall organic molecule
Emp. Form.C13H17N3
Mol. Mass.215.2942
SMILESC=CCc1ccccc1NCC1=NCCN1