Reaction Details
TargetNAD-dependent protein deacetylase sirtuin-1
LigandBDBM32102
Substrate/Competitorn/a
Meas. Tech.ChEMBL_1614274 (CHEMBL3856343)
IC50 870±n/a nM
Citation Kumar, AChauhan, S How much successful are the medicinal chemists in modulation of SIRT1: A critical review. Eur J Med Chem119:45-69 (2016) 
 
NAD-dependent protein deacetylase sirtuin-1
Name:NAD-dependent protein deacetylase sirtuin-1
Type:Developmental protein; hydrolase
Mol. Mass.:81626.66
Organism:Homo sapiens (Human)
Description:n/a
Residue:747
BDBM32102
NameBDBM32102
Synonyms:1,6-dimethylpyrimido[5,4-e][1,2,4]triazine-5,7(1H,6H)-dione 1,6-dimethylpyrimido[5,4-e][1,2,4]triazine-5,7-quinone SMR000024051 US9738628, Compound PKF118-310 | cid_66541
TypeSmall organic molecule
Emp. Form.C7H7N5O2
Mol. Mass.193.1628
SMILESCn1ncnc2c1nc(=O)n(C)c2=O