Reaction Details
TargetReceptor-type tyrosine-protein kinase FLT3
LigandBDBM50193112
Substrate/Competitorn/a
Meas. Tech.ChEMBL_1614564 (CHEMBL3856633)
IC50 8.0±n/a nM
Citation Kim, HLee, CYang, JSChoi, SPark, CHKang, JSOh, SJYun, JKim, MHHan, G Structural modifications at the 6-position of thieno[2,3-d]pyrimidines and their effects on potency at FLT3 for treatment of acute myeloid leukemia. Eur J Med Chem120:74-85 (2016) 
 
Receptor-type tyrosine-protein kinase FLT3
Name:Receptor-type tyrosine-protein kinase FLT3
Type:Enzyme
Mol. Mass.:112888.62
Organism:Homo sapiens (Human)
Description:P36888
Residue:993
BDBM50193112
NameBDBM50193112
Synonyms:CHEMBL3966536
TypeSmall organic molecule
Emp. Form.C25H24ClN5O3S2
Mol. Mass.542.073
SMILESCl.CNCCOc1ccc(cc1)-c1sc2nc(nc(NN3C(=O)C=C(C)C3=O)c2c1C)-c1cccs1