Reaction Details
TargetReceptor-type tyrosine-protein kinase FLT3
LigandBDBM50193118
Substrate/Competitorn/a
Meas. Tech.ChEMBL_1614564 (CHEMBL3856633)
IC50 11±n/a nM
Citation Kim, HLee, CYang, JSChoi, SPark, CHKang, JSOh, SJYun, JKim, MHHan, G Structural modifications at the 6-position of thieno[2,3-d]pyrimidines and their effects on potency at FLT3 for treatment of acute myeloid leukemia. Eur J Med Chem120:74-85 (2016) 
 
Receptor-type tyrosine-protein kinase FLT3
Name:Receptor-type tyrosine-protein kinase FLT3
Type:Enzyme
Mol. Mass.:112888.62
Organism:Homo sapiens (Human)
Description:P36888
Residue:993
BDBM50193118
NameBDBM50193118
Synonyms:CHEMBL3904118
TypeSmall organic molecule
Emp. Form.C17H14N4O2S2
Mol. Mass.370.449
SMILESCC1=CC(=O)N(Nc2nc(nc3sc(C)c(C)c23)-c2cccs2)C1=O