Reaction Details
TargetCannabinoid receptor 1
LigandBDBM50176980
Substrate/Competitorn/a
Meas. Tech.ChEBML_1615640
Ki 4.5±n/a nM
Citation Lazzari, PDistinto, RManca, IBaillie, GMurineddu, GPira, MFalzoi, MSani, MMorales, PRoss, RZanda, MJagerovic, NPinna, GA A critical review of both the synthesis approach and the receptor profile of the 8-chloro-1-(2',4'-dichlorophenyl)-N-piperidin-1-yl-1,4,5,6-tetrahydrobenzo[6,7]cyclohepta[1,2-c]pyrazole-3-carboxamide and analogue derivatives. Eur J Med Chem121:194-208 (2016) 
 
Cannabinoid receptor 1
Name:Cannabinoid receptor 1
Type:Enzyme
Mol. Mass.:52842.52
Organism:Mus musculus (Mouse)
Description:P47746
Residue:473
BDBM50176980
NameBDBM50176980
Synonyms:8-chloro-1-(2',4'-dichlorophenyl)-N-homopiperidin-1-yl-1,4,5,6-tetrahydrobenzo[6,7]cyclohepta[1,2-c]pyrazole-3-carboxamide | CHEMBL223278
TypeSmall organic molecule
Emp. Form.C25H25Cl3N4O
Mol. Mass.503.851
SMILESClc1ccc(c(Cl)c1)-n1nc(C(=O)NN2CCCCCC2)c2CCCc3cc(Cl)ccc3-c12