Reaction Details
TargetHepatocyte growth factor receptor
LigandBDBM50193395
Substrate/Competitorn/a
Meas. Tech.ChEMBL_1615840 (CHEMBL3857909)
IC50 2.7±n/a nM
Citation Talele, TT The"Cyclopropyl Fragment" is a Versatile Player that Frequently Appears in Preclinical/Clinical Drug Molecules. J Med Chem59:8712-8756 (2016) 
 
Hepatocyte growth factor receptor
Name:Hepatocyte growth factor receptor
Type:Protein
Mol. Mass.:155559.73
Organism:Homo sapiens (Human)
Description:P08581
Residue:1390
BDBM50193395
NameBDBM50193395
Synonyms:Altiratinib DP-5164
TypeSmall organic molecule
Emp. Form.C26H21F3N4O4
Mol. Mass.510.4645
SMILESFc1ccc(NC(=O)C2(CC2)C(=O)Nc2cc(F)c(Oc3ccnc(NC(=O)C4CC4)c3)cc2F)cc1