Reaction Details
TargetSerine/threonine-protein kinase PLK1
LigandBDBM50402023
Substrate/Competitorn/a
Meas. Tech.ChEMBL_1615838 (CHEMBL3857907)
IC50 0.870000±n/a nM
Citation Talele, TT The"Cyclopropyl Fragment" is a Versatile Player that Frequently Appears in Preclinical/Clinical Drug Molecules. J Med Chem59:8712-8756 (2016) 
 
Serine/threonine-protein kinase PLK1
Name:Serine/threonine-protein kinase PLK1
Type:Serine/threonine-protein kinase
Mol. Mass.:68277.16
Organism:Homo sapiens (Human)
Description:P53350
Residue:603
BDBM50402023
NameBDBM50402023
Synonyms:BI 6727 | VOLASERTIB
TypeSmall organic molecule
Emp. Form.C34H50N8O3
Mol. Mass.618.8126
SMILESCC[C@H]1N(C(C)C)c2nc(Nc3ccc(cc3OC)C(=O)N[C@H]3CC[C@@H](CC3)N3CCN(CC4CC4)CC3)ncc2N(C)C1=O