Reaction Details
TargetKappa-type opioid receptor
LigandBDBM50045776
Substrate/Competitorn/a
Meas. Tech.ChEMBL_1615867 (CHEMBL3857936)
Ki 0.083000±n/a nM
Citation Talele, TT The"Cyclopropyl Fragment" is a Versatile Player that Frequently Appears in Preclinical/Clinical Drug Molecules. J Med Chem59:8712-8756 (2016) 
 
Kappa-type opioid receptor
Name:Kappa-type opioid receptor
Type:G Protein-Coupled Receptor (GPCR)
Mol. Mass.:42648.76
Organism:Homo sapiens (Human)
Description:P41145
Residue:380
BDBM50045776
NameBDBM50045776
Synonyms:CHEMBL982 NALMEFENE ORF-11676 cid_5284594
TypeSmall organic molecule
Emp. Form.C21H25NO3
Mol. Mass.339.4281
SMILESOc1ccc2C[C@H]3N(CC4CC4)CC[C@@]45[C@@H](Oc1c24)C(=C)CC[C@@]35O