Reaction Details
TargetAcetylcholinesterase
LigandBDBM8963
Substrate/Competitorn/a
Meas. Tech.ChEMBL_1615950 (CHEMBL3858019)
IC50 5.3±n/a nM
Citation Ceschi, MAda Costa, JSLopes, JPBCâmara, VSCampo, LFBorges, ACAGonçalves, CASde Souza, DFKonrath, ELKarl, ALMGuedes, IADardenne, LE Novel series of tacrine-tianeptine hybrids: Synthesis, cholinesterase inhibitory activity, S100B secretion and a molecular modeling approach. Eur J Med Chem121:758-772 (2016) 
 
Acetylcholinesterase
Name:Acetylcholinesterase
Type:Enzyme
Mol. Mass.:68193.62
Organism:Rattus norvegicus (rat)
Description:P37136
Residue:614
BDBM8963
NameBDBM8963
Synonyms:CHEMBL32823 N-[7-(1,2,3,4-tetrahydroacridin-9-ylamino)heptyl]-1,2,3,4-tetrahydroacridin-9-amine Tacrine-Based Inhibitor 2f | tacrine homobivalent compound 3a
TypeSmall organic molecule
Emp. Form.C33H40N4
Mol. Mass.492.6975
SMILESC(CCCNc1c2CCCCc2nc2ccccc12)CCCNc1c2CCCCc2nc2ccccc12