Reaction Details
TargetCholinesterase
LigandBDBM50193539
Substrate/Competitorn/a
Meas. Tech.ChEMBL_1615951 (CHEMBL3858020)
IC50 3.8±n/a nM
Citation Ceschi, MAda Costa, JSLopes, JPBCâmara, VSCampo, LFBorges, ACAGonçalves, CASde Souza, DFKonrath, ELKarl, ALMGuedes, IADardenne, LE Novel series of tacrine-tianeptine hybrids: Synthesis, cholinesterase inhibitory activity, S100B secretion and a molecular modeling approach. Eur J Med Chem121:758-772 (2016) 
 
Cholinesterase
Name:Cholinesterase
Type:Homotetramer
Mol. Mass.:68422.27
Organism:Homo sapiens (Human)
Description:P06276
Residue:602
BDBM50193539
NameBDBM50193539
Synonyms:CHEMBL3906729
TypeSmall organic molecule
Emp. Form.C40H50ClN5O3S
Mol. Mass.716.375
SMILESCN1c2ccccc2C(NCCCCCCC(=O)NCCCCCCNc2c3CCCCc3nc3ccccc23)c2ccc(Cl)cc2S1(=O)=O