Reaction Details
TargetTransient receptor potential cation channel subfamily A member 1
LigandBDBM50193602
Substrate/Competitorn/a
Meas. Tech.ChEMBL_1615960 (CHEMBL3858029)
IC50 1.000000±n/a nM
Citation Blass, B N-(2-Alkyleneimino-3-phenylpropyl)acetamide Compounds and Their Use against Pain and Pruritus via Inhibition of TRPA1 Channels. ACS Med Chem Lett7:658-9 (2016) 
 
Transient receptor potential cation channel subfamily A member 1
Name:Transient receptor potential cation channel subfamily A member 1
Type:Protein
Mol. Mass.:127514.20
Organism:Homo sapiens (Human)
Description:O75762
Residue:1119
BDBM50193602
NameBDBM50193602
Synonyms:CHEMBL3907685
TypeSmall organic molecule
Emp. Form.C27H32ClF3N2O2
Mol. Mass.509.003
SMILESOC1(CCN(CC1)C(CNC(=O)C1(CCCC1)c1ccc(Cl)cc1)Cc1ccccc1)C(F)(F)F