Reaction Details
TargetChromobox protein homolog 7
LigandBDBM50194467
Substrate/Competitorn/a
Meas. Tech.ChEMBL_1616628 (CHEMBL3858697)
IC50>60000±n/a nM
Citation Stuckey, JISimpson, CNorris-Drouin, JLCholensky, SHLee, JPasca, RCheng, NDickson, BMPearce, KHFrye, SVJames, LI Structure-Activity Relationships and Kinetic Studies of Peptidic Antagonists of CBX Chromodomains. J Med Chem59:8913-8923 (2016) 
 
Chromobox protein homolog 7
Name:Chromobox protein homolog 7
Type:Protein
Mol. Mass.:28351.76
Organism:Homo sapiens (Human)
Description:n/a
Residue:251
BDBM50194467
NameBDBM50194467
Synonyms:CHEMBL3918626
TypeSmall organic molecule
Emp. Form.C41H60N8O9
Mol. Mass.808.9633
SMILESCOC(=O)[C@H](CO)NC(=O)[C@H](CCCCN(C)C1CNC1)NC(=O)[C@H](CC(C)C)NC(=O)[C@H](C)NC(=O)[C@H](Cc1ccccc1)NC(=O)CNC(=O)c1ccccc1