Reaction Details
TargetChromobox protein homolog 5
LigandBDBM50194475
Substrate/Competitorn/a
Meas. Tech.ChEMBL_1616626 (CHEMBL3858695)
IC50>60000±n/a nM
Citation Stuckey, JISimpson, CNorris-Drouin, JLCholensky, SHLee, JPasca, RCheng, NDickson, BMPearce, KHFrye, SVJames, LI Structure-Activity Relationships and Kinetic Studies of Peptidic Antagonists of CBX Chromodomains. J Med Chem59:8913-8923 (2016) 
 
Chromobox protein homolog 5
Name:Chromobox protein homolog 5
Type:PROTEIN
Mol. Mass.:22222.71
Organism:Homo sapiens (Human)
Description:ChEMBL_116826
Residue:191
BDBM50194475
NameBDBM50194475
Synonyms:CHEMBL3889586
TypeSmall organic molecule
Emp. Form.C44H68N6O8
Mol. Mass.809.0461
SMILESCCN(CCCC[C@H](NC(=O)[C@H](CC(C)C)NC(=O)[C@H](C)NC(=O)[C@H](Cc1ccccc1)NC(=O)c1ccc(cc1)C(C)(C)C)C(=O)N[C@@H](CO)C(=O)OC)C(C)C