Reaction Details
TargetE3 SUMO-protein ligase CBX4
LigandBDBM50194478
Substrate/Competitorn/a
Meas. Tech.ChEMBL_1616630 (CHEMBL3858699)
IC50>60000±n/a nM
Citation Stuckey, JISimpson, CNorris-Drouin, JLCholensky, SHLee, JPasca, RCheng, NDickson, BMPearce, KHFrye, SVJames, LI Structure-Activity Relationships and Kinetic Studies of Peptidic Antagonists of CBX Chromodomains. J Med Chem59:8913-8923 (2016) 
 
E3 SUMO-protein ligase CBX4
Name:E3 SUMO-protein ligase CBX4
Type:PROTEIN
Mol. Mass.:61401.05
Organism:Homo sapiens (Human)
Description:ChEMBL_108273
Residue:560
BDBM50194478
NameBDBM50194478
Synonyms:CHEMBL3907836
TypeSmall organic molecule
Emp. Form.C42H61N7O9
Mol. Mass.807.9752
SMILESCOC(=O)[C@H](CO)NC(=O)[C@H](CCCCNC1CCCC1)NC(=O)[C@H](CC(C)C)NC(=O)[C@H](C)NC(=O)[C@H](Cc1ccccc1)NC(=O)CNC(=O)c1ccccc1