Reaction Details
TargetChromodomain Y-like protein 2
LigandBDBM50194473
Substrate/Competitorn/a
Meas. Tech.ChEMBL_1616627 (CHEMBL3858696)
IC50 560±n/a nM
Citation Stuckey, JISimpson, CNorris-Drouin, JLCholensky, SHLee, JPasca, RCheng, NDickson, BMPearce, KHFrye, SVJames, LI Structure-Activity Relationships and Kinetic Studies of Peptidic Antagonists of CBX Chromodomains. J Med Chem59:8913-8923 (2016) 
 
Chromodomain Y-like protein 2
Name:Chromodomain Y-like protein 2
Type:PROTEIN
Mol. Mass.:56517.92
Organism:Homo sapiens (Human)
Description:ChEMBL_116982
Residue:506
BDBM50194473
NameBDBM50194473
Synonyms:CHEMBL3916999
TypeSmall organic molecule
Emp. Form.C40H60N6O8
Mol. Mass.752.9398
SMILESCCN(CC)CCCC[C@H](NC(=O)[C@H](CC(C)C)NC(=O)[C@H](C)NC(=O)[C@H](Cc1ccccc1)NC(=O)c1ccccc1C)C(=O)N[C@@H](CO)C(=O)OC