Reaction Details
TargetChromobox protein homolog 7
LigandBDBM50194263
Substrate/Competitorn/a
Meas. Tech.ChEMBL_1616652 (CHEMBL3858721)
Kd 10300±n/a nM
Citation Stuckey, JISimpson, CNorris-Drouin, JLCholensky, SHLee, JPasca, RCheng, NDickson, BMPearce, KHFrye, SVJames, LI Structure-Activity Relationships and Kinetic Studies of Peptidic Antagonists of CBX Chromodomains. J Med Chem59:8913-8923 (2016) 
 
Chromobox protein homolog 7
Name:Chromobox protein homolog 7
Type:Protein
Mol. Mass.:28351.76
Organism:Homo sapiens (Human)
Description:n/a
Residue:251
BDBM50194263
NameBDBM50194263
Synonyms:CHEMBL3970021
TypeSmall organic molecule
Emp. Form.C40H60N7O9
Mol. Mass.782.9454
SMILESCOC(=O)[C@H](CO)NC(=O)[C@H](CCCC[N+](C)(C)C)NC(=O)[C@H](CC(C)C)NC(=O)[C@H](C)NC(=O)[C@H](Cc1ccccc1)NC(=O)CNC(=O)c1ccccc1