Reaction Details
TargetChromobox protein homolog 7
LigandBDBM50194431
Substrate/Competitorn/a
Meas. Tech.ChEMBL_1616628 (CHEMBL3858697)
IC50 51000±n/a nM
Citation Stuckey, JISimpson, CNorris-Drouin, JLCholensky, SHLee, JPasca, RCheng, NDickson, BMPearce, KHFrye, SVJames, LI Structure-Activity Relationships and Kinetic Studies of Peptidic Antagonists of CBX Chromodomains. J Med Chem59:8913-8923 (2016) 
 
Chromobox protein homolog 7
Name:Chromobox protein homolog 7
Type:Protein
Mol. Mass.:28351.76
Organism:Homo sapiens (Human)
Description:n/a
Residue:251
BDBM50194431
NameBDBM50194431
Synonyms:CHEMBL3954152
TypeSmall organic molecule
Emp. Form.C39H57N7O9
Mol. Mass.767.9114
SMILESCOC(=O)[C@H](CO)NC(=O)[C@H](CCCCN(C)C)NC(=O)[C@H](CC(C)C)NC(=O)[C@H](C)NC(=O)[C@H](Cc1ccccc1)NC(=O)CNC(=O)c1ccccc1