Reaction Details
TargetE3 SUMO-protein ligase CBX4
LigandBDBM50194458
Substrate/Competitorn/a
Meas. Tech.ChEMBL_1616630 (CHEMBL3858699)
IC50 170±n/a nM
Citation Stuckey, JISimpson, CNorris-Drouin, JLCholensky, SHLee, JPasca, RCheng, NDickson, BMPearce, KHFrye, SVJames, LI Structure-Activity Relationships and Kinetic Studies of Peptidic Antagonists of CBX Chromodomains. J Med Chem59:8913-8923 (2016) 
 
E3 SUMO-protein ligase CBX4
Name:E3 SUMO-protein ligase CBX4
Type:PROTEIN
Mol. Mass.:61401.05
Organism:Homo sapiens (Human)
Description:ChEMBL_108273
Residue:560
BDBM50194458
NameBDBM50194458
Synonyms:CHEMBL3987134
TypeSmall organic molecule
Emp. Form.C44H69N7O8
Mol. Mass.824.0608
SMILESCCN(CC)CCCC[C@H](NC(=O)[C@H](CC(C)C)NC(=O)[C@H](C)NC(=O)[C@H](Cc1ccc(CN)cc1)NC(=O)c1ccc(cc1)C(C)(C)C)C(=O)N[C@@H](CO)C(=O)OC