Reaction Details
TargetChromobox protein homolog 7
LigandBDBM50194458
Substrate/Competitorn/a
Meas. Tech.ChEMBL_1616628 (CHEMBL3858697)
IC50 63±n/a nM
Citation Stuckey, JISimpson, CNorris-Drouin, JLCholensky, SHLee, JPasca, RCheng, NDickson, BMPearce, KHFrye, SVJames, LI Structure-Activity Relationships and Kinetic Studies of Peptidic Antagonists of CBX Chromodomains. J Med Chem59:8913-8923 (2016) 
 
Chromobox protein homolog 7
Name:Chromobox protein homolog 7
Type:Protein
Mol. Mass.:28351.76
Organism:Homo sapiens (Human)
Description:n/a
Residue:251
BDBM50194458
NameBDBM50194458
Synonyms:CHEMBL3987134
TypeSmall organic molecule
Emp. Form.C44H69N7O8
Mol. Mass.824.0608
SMILESCCN(CC)CCCC[C@H](NC(=O)[C@H](CC(C)C)NC(=O)[C@H](C)NC(=O)[C@H](Cc1ccc(CN)cc1)NC(=O)c1ccc(cc1)C(C)(C)C)C(=O)N[C@@H](CO)C(=O)OC