Reaction Details
TargetKinesin-like protein KIF20B
LigandBDBM50056928
Substrate/Competitorn/a
Meas. Tech.ChEMBL_1618000 (CHEMBL3860169)
IC50 24400±n/a nM
Citation Talapatra, SKRath, OClayton, ETomasi, SKozielski, F Depsidones from Lichens as Natural Product Inhibitors of M-Phase Phosphoprotein 1, a Human Kinesin Required for Cytokinesis. J Nat Prod79:1576-85 (2016) 
 
Kinesin-like protein KIF20B
Name:Kinesin-like protein KIF20B
Type:PROTEIN
Mol. Mass.:210600.28
Organism:Homo sapiens (Human)
Description:ChEMBL_104519
Residue:1820
BDBM50056928
NameBDBM50056928
Synonyms:3,8-Dihydroxy-1-pentanoyl-6-pentyl-dibenzo[b,e][1,4]dioxepin-11-one NSC-31867
TypeSmall organic molecule
Emp. Form.C23H26O6
Mol. Mass.398.4489
SMILESCCCCCc1cc(O)cc2OC(=O)c3c(Oc12)cc(O)cc3C(=O)CCCC