Reaction Details
TargetHigh affinity choline transporter 1
LigandBDBM50196415
Substrate/Competitorn/a
Meas. Tech.ChEMBL_1618520 (CHEMBL3860689)
IC50 3350±n/a nM
Citation Bertron, JLEnnis, EATarr, CJWright, JDickerson, JWLocuson, CWBlobaum, ALRook, JMBlakely, RDLindsley, CW Optimization of the choline transporter (CHT) inhibitor ML352: Development of VU6001221, an improved in vivo tool compound. Bioorg Med Chem Lett26:4637-4640 (2016) 
 
High affinity choline transporter 1
Name:High affinity choline transporter 1
Type:PROTEIN
Mol. Mass.:63194.33
Organism:Homo sapiens (Human)
Description:ChEMBL_1464247
Residue:580
BDBM50196415
NameBDBM50196415
Synonyms:CHEMBL3970338
TypeSmall organic molecule
Emp. Form.C21H26N4O3
Mol. Mass.382.4561
SMILESCC(C)c1cc(CNC(=O)c2ccc(C#N)c(OC3CCN(C)CC3)c2)on1