Reaction Details
TargetHistone deacetylase 1
LigandBDBM50196729
Substrate/Competitorn/a
Meas. Tech.ChEMBL_1618822 (CHEMBL3860991)
IC50 14±n/a nM
Citation Rabal, OSánchez-Arias, JACuadrado-Tejedor, Mde Miguel, IPérez-González, MGarcía-Barroso, CUgarte, AEstella-Hermoso de Mendoza, ASáez, EEspelosin, MUrsua, SHaizhong, TWei, WMusheng, XGarcia-Osta, AOyarzabal, J Design, Synthesis, and Biological Evaluation of First-in-Class Dual Acting Histone Deacetylases (HDACs) and Phosphodiesterase 5 (PDE5) Inhibitors for the Treatment of Alzheimer's Disease. J Med Chem59:8967-9004 (2016) 
 
Histone deacetylase 1
Name:Histone deacetylase 1
Type:Enzyme
Mol. Mass.:55090.27
Organism:Homo sapiens (Human)
Description:Q13547
Residue:482
BDBM50196729
NameBDBM50196729
Synonyms:CHEMBL3923840
TypeSmall organic molecule
Emp. Form.C26H31N9O4
Mol. Mass.533.5822
SMILESCCOc1ccc(CN2CCN(CC2)c2ncc(cn2)C(=O)NO)cc1-c1nc2c(CC)nn(C)c2c(=O)[nH]1