Reaction Details
TargetcGMP-specific 3',5'-cyclic phosphodiesterase
LigandBDBM50196760
Substrate/Competitorn/a
Meas. Tech.ChEMBL_1618821 (CHEMBL3860990)
IC50 0.500000±n/a nM
Citation Rabal, OSánchez-Arias, JACuadrado-Tejedor, Mde Miguel, IPérez-González, MGarcía-Barroso, CUgarte, AEstella-Hermoso de Mendoza, ASáez, EEspelosin, MUrsua, SHaizhong, TWei, WMusheng, XGarcia-Osta, AOyarzabal, J Design, Synthesis, and Biological Evaluation of First-in-Class Dual Acting Histone Deacetylases (HDACs) and Phosphodiesterase 5 (PDE5) Inhibitors for the Treatment of Alzheimer's Disease. J Med Chem59:8967-9004 (2016) 
 
cGMP-specific 3',5'-cyclic phosphodiesterase
Name:cGMP-specific 3',5'-cyclic phosphodiesterase
Type:Protein
Mol. Mass.:99975.83
Organism:Homo sapiens (Human)
Description:O76074
Residue:875
BDBM50196760
NameBDBM50196760
Synonyms:CHEMBL3954968
TypeSmall organic molecule
Emp. Form.C25H34N6O6S
Mol. Mass.546.639
SMILESCCCc1nn(C)c2c1nc([nH]c2=O)-c1cc(ccc1OCC)S(=O)(=O)N1CCC(CCC(=O)NO)CC1