Reaction Details
TargetcGMP-specific 3',5'-cyclic phosphodiesterase
LigandBDBM50196774
Substrate/Competitorn/a
Meas. Tech.ChEMBL_1618821 (CHEMBL3860990)
IC50 5.0±n/a nM
Citation Rabal, OSánchez-Arias, JACuadrado-Tejedor, Mde Miguel, IPérez-González, MGarcía-Barroso, CUgarte, AEstella-Hermoso de Mendoza, ASáez, EEspelosin, MUrsua, SHaizhong, TWei, WMusheng, XGarcia-Osta, AOyarzabal, J Design, Synthesis, and Biological Evaluation of First-in-Class Dual Acting Histone Deacetylases (HDACs) and Phosphodiesterase 5 (PDE5) Inhibitors for the Treatment of Alzheimer's Disease. J Med Chem59:8967-9004 (2016) 
 
cGMP-specific 3',5'-cyclic phosphodiesterase
Name:cGMP-specific 3',5'-cyclic phosphodiesterase
Type:Protein
Mol. Mass.:99975.83
Organism:Homo sapiens (Human)
Description:O76074
Residue:875
BDBM50196774
NameBDBM50196774
Synonyms:CHEMBL3895860
TypeSmall organic molecule
Emp. Form.C21H21N5O5
Mol. Mass.423.4219
SMILESCCOc1ccc(cc1-c1nc2c(CC)nn(C)c2c(=O)[nH]1)-c1ccc(o1)C(=O)NO