Reaction Details
TargetSerine/threonine-protein kinase mTOR
LigandBDBM92862
Substrate/Competitorn/a
Meas. Tech.ChEMBL_1619103 (CHEMBL3861272)
IC50 2.0±n/a nM
Citation Falasca, MHamilton, JRSelvadurai, MSundaram, KAdamska, AThompson, PE Class II Phosphoinositide 3-Kinases as Novel Drug Targets. J Med Chem60:47-65 (2017) 
 
Serine/threonine-protein kinase mTOR
Name:Serine/threonine-protein kinase mTOR
Type:Rapamycin target protein
Mol. Mass.:288917.12
Organism:Homo sapiens (Human)
Description:P42345
Residue:2549
BDBM92862
NameBDBM92862
Synonyms:US9284315, BEZ-235 | mTOR Inhibitor, BEZ235
TypeSmall molecule
Emp. Form.C30H23N5O
Mol. Mass.469.5365
SMILESCn1c2cnc3ccc(cc3c2n(-c2ccc(cc2)C(C)(C)C#N)c1=O)-c1cnc2ccccc2c1