Reaction Details
TargetPhosphatidylinositol 4,5-bisphosphate 3-kinase catalytic subunit gamma isoform
LigandBDBM50042924
Substrate/Competitorn/a
Meas. Tech.ChEMBL_1619095 (CHEMBL3861264)
IC50 16±n/a nM
Citation Falasca, MHamilton, JRSelvadurai, MSundaram, KAdamska, AThompson, PE Class II Phosphoinositide 3-Kinases as Novel Drug Targets. J Med Chem60:47-65 (2017) 
 
Phosphatidylinositol 4,5-bisphosphate 3-kinase catalytic subunit gamma isoform
Name:Phosphatidylinositol 4,5-bisphosphate 3-kinase catalytic subunit gamma isoform
Type:Enzyme Subunit
Mol. Mass.:126470.30
Organism:Homo sapiens (Human)
Description:P48736
Residue:1102
BDBM50042924
NameBDBM50042924
Synonyms:CHEMBL1229535
TypeSmall organic molecule
Emp. Form.C14H16ClN3O4S2
Mol. Mass.389.878
SMILESCC(=O)\N=c1\[nH]c(C)c(s1)-c1ccc(Cl)c(c1)S(=O)(=O)NCCO