Reaction Details
TargetDNA-dependent protein kinase catalytic subunit
LigandBDBM50042924
Substrate/Competitorn/a
Meas. Tech.ChEMBL_1619097 (CHEMBL3861266)
IC50 64±n/a nM
Citation Falasca, MHamilton, JRSelvadurai, MSundaram, KAdamska, AThompson, PE Class II Phosphoinositide 3-Kinases as Novel Drug Targets. J Med Chem60:47-65 (2017) 
 
DNA-dependent protein kinase catalytic subunit
Name:DNA-dependent protein kinase catalytic subunit
Type:Protein
Mol. Mass.:469114.78
Organism:Homo sapiens (Human)
Description:P78527
Residue:4128
BDBM50042924
NameBDBM50042924
Synonyms:CHEMBL1229535
TypeSmall organic molecule
Emp. Form.C14H16ClN3O4S2
Mol. Mass.389.878
SMILESCC(=O)\N=c1\[nH]c(C)c(s1)-c1ccc(Cl)c(c1)S(=O)(=O)NCCO