Reaction Details
TargetHistone deacetylase 1/2/3
LigandBDBM50005711
Substrate/Competitorn/a
Meas. Tech.ChEMBL_1619166 (CHEMBL3861335)
IC50 5.9±n/a nM
Citation Zwick, VSimões-Pires, CANurisso, APetit, CDos Santos Passos, CRandazzo, GMMartinet, NBertrand, PCuendet, M Synthesis of a selective HDAC6 inhibitor active in neuroblasts. Bioorg Med Chem Lett26:4955-4959 (2016) 
 
Histone deacetylase 1/2/3
Name:Histone deacetylase 1/2/3
Synonyms:n/a
Type:n/a
Mol. Mass.:n/a
Description:ASSAY_ID of ChEMBL is 1815634
Components:This complex has 3 components.
Component 1
Name:Histone deacetylase 1
Type:Enzyme
Mol. Mass.:55090.27
Organism:Homo sapiens (Human)
Description:Q13547
Residue:482
Component 2
Name:Histone deacetylase 3
Synonyms:HD3 HDAC3_HUMAN Human HDAC3 SMAP45
Type:Enzyme
Mol. Mass.:48829.55
Organism:Homo sapiens (Human)
Description:O15379
Residue:428
Component 3
Name:Histone deacetylase 2
Synonyms:Cereblon/Histone deacetylase 2 HDAC2 Histone deacetylase 2 (HDAC2) | Human HDAC2
Type:Chromatin regulator; hydrolase; repressor
Mol. Mass.:55356.54
Organism:Homo sapiens (Human)
Description:Q92769
Residue:488
BDBM50005711
NameBDBM50005711
Synonyms:CHEBI:46024 TRICHOSTATIN Trichostatin A (TSA) US10722597, Compound Trichostatin US20230322747, Compound trichostatin A | US9265734, TSA
TypeSmall organic molecule
Emp. Form.C17H22N2O3
Mol. Mass.302.3682
SMILESC[C@H](\C=C(/C)\C=C\C(=O)NO)C(=O)c1ccc(cc1)N(C)C