Reaction Details
TargetMicrotubule-associated protein 2
LigandBDBM50197323
Substrate/Competitorn/a
Meas. Tech.ChEBML_1619395
IC50 920±n/a nM
Citation Weglarz-Tomczak, EBurda-Grabowska, MGiurg, MMucha, A Identification of methionine aminopeptidase 2 as a molecular target of the organoselenium drug ebselen and its derivatives/analogues: Synthesis, inhibitory activity and molecular modeling study. Bioorg Med Chem Lett26:5254-5259 (2016) 
 
Microtubule-associated protein 2
Name:Microtubule-associated protein 2
Type:PROTEIN
Mol. Mass.:199423.64
Organism:Homo sapiens (Human)
Description:ChEMBL_107603
Residue:1827
BDBM50197323
NameBDBM50197323
Synonyms:CHEMBL3931605
TypeSmall organic molecule
Emp. Form.C15H13NO2Se
Mol. Mass.318.23
SMILESCOc1ccc(C)cc1-n1[se]c2ccccc2c1=O