Reaction Details
TargetMicrotubule-associated protein 2
LigandBDBM50197347
Substrate/Competitorn/a
Meas. Tech.ChEBML_1619395
IC50 230±n/a nM
Citation Weglarz-Tomczak, EBurda-Grabowska, MGiurg, MMucha, A Identification of methionine aminopeptidase 2 as a molecular target of the organoselenium drug ebselen and its derivatives/analogues: Synthesis, inhibitory activity and molecular modeling study. Bioorg Med Chem Lett26:5254-5259 (2016) 
 
Microtubule-associated protein 2
Name:Microtubule-associated protein 2
Type:PROTEIN
Mol. Mass.:199423.64
Organism:Homo sapiens (Human)
Description:ChEMBL_107603
Residue:1827
BDBM50197347
NameBDBM50197347
Synonyms:Ebselen Diselenide
TypeSmall organic molecule
Emp. Form.C26H20N2O2Se2
Mol. Mass.550.37
SMILESO=C(Nc1ccccc1)c1ccccc1[Se][Se]c1ccccc1C(=O)Nc1ccccc1